Commit: odoo:3f7307a6  
Subject: TEMPORARY (hopefully) - undo Odoo bug:
Author: Richard deMeester
Committer: Richard deMeester
Commit: enterprise:f07d05b4  
Subject: [FIX] delivery_easypost: fix Easypost integration
Author: Paweł Fertyk
Committer: Paweł Fertyk
Version: 17.0
Config: Coverage tests with pre-installed modules
Total time: 14m
Stats: Build 41868
Date Level Type Message
2023-12-04 06:25:03 INFO runbot Init build environment with config Coverage tests with pre-installed modules
2023-12-04 06:25:03 Starting step pre_install_modules from config Coverage tests with pre-installed modules
2023-12-04 06:25:03 INFO runbot Using Dockerfile Tag odoo:WilldooITv17
2023-12-04 06:25:33 INFO server odoo.modules.loading:301 1 modules loaded in 6.99s, 9001 queries (+9001 extra)
2023-12-04 06:25:39 INFO server odoo.modules.loading:301 17 modules loaded in 4.05s, 6614 queries (+6614 extra)
2023-12-04 06:25:39 Step pre_install_modules finished in 36s
2023-12-04 06:25:39 Starting step tests_coverage from config Coverage tests with pre-installed modules
2023-12-04 06:25:39 INFO runbot Using Dockerfile Tag odoo:WilldooITv17
2023-12-04 06:27:18 INFO server odoo.modules.loading:301 1 modules loaded in 87.66s, 2 queries (+22293 extra)
2023-12-04 06:27:18 ERROR server odoo.addons.base.models.ir_model:2008 Missing model web_tour.tour
2023-12-04 06:27:18 ERROR server odoo.addons.base.models.ir_model:2008 Missing model iap.account
2023-12-04 06:27:24 ERROR server odoo.addons.base.models.ir_model:2008 Missing model web_tour.tour
2023-12-04 06:27:24 ERROR server odoo.addons.base.models.ir_model:2008 Missing model iap.account
2023-12-04 06:27:24 ERROR server odoo.addons.base.models.ir_model:2008 Missing model web_tour.tour
2023-12-04 06:27:24 ERROR server odoo.addons.base.models.ir_model:2008 Missing model iap.account
2023-12-04 06:27:41 INFO server odoo.modules.loading:301 17 modules loaded in 23.14s, 18 queries (+2916 extra)
2023-12-04 06:27:41 INFO server odoo.addons.base.models.ir_qweb:301 Pregenerating assets bundles
2023-12-04 06:29:48 INFO server odoo.addons.base.tests.test_reports:301 Report PDF in: /data/build/tests/41868-17-0-all/screenshots/pdf_20231204_062944_668305_test_thead_tbody_repeat.pdf
2023-12-04 06:29:48 ERROR server odoo.addons.base.tests.test_reports:499
ERROR: TestReportsRendering.test_thead_tbody_repeat
Traceback (most recent call last):
  File "/data/build/odoo/odoo/addons/base/tests/test_reports.py", line 499, in test_thead_tbody_repeat
    page_break_at = int(pages[1][5][1])  # This element should be the first line of the table, 28 when this test was written
                    ^^^^^^^^^^^^^^^^^^^
ValueError: invalid literal for int() with base 10: '28\n29\n30\n31\n32\n33\n34\n35\n36\n37\n38\n39\n40\n41\n42\n43\n44\n45\n46\n47\n48\n49'
2023-12-04 06:30:17 ERROR server odoo.addons.bus.tests.test_websocket_rate_limiting:31
FAIL: TestWebsocketRateLimiting.test_rate_limiting_base_ko
Traceback (most recent call last):
  File "/data/build/odoo/addons/bus/tests/test_websocket_rate_limiting.py", line 31, in test_rate_limiting_base_ko
    with self.assertRaises(WebSocketProtocolException) as cm:
  File "/usr/local/lib/python3.11/contextlib.py", line 144, in __exit__
    next(self.gen)
  File "/data/build/odoo/odoo/tests/common.py", line 428, in _assertRaises
    with ExitStack() as inner:
  File "/usr/local/lib/python3.11/contextlib.py", line 589, in __exit__
    raise exc_details[1]
  File "/usr/local/lib/python3.11/contextlib.py", line 574, in __exit__
    if cb(*exc_details):
       ^^^^^^^^^^^^^^^^
AssertionError: WebSocketProtocolException not raised
2023-12-04 06:30:23 ERROR server websocket:64 close status: 1013
2023-12-04 06:30:23 ERROR server odoo.addons.bus.tests.test_websocket_rate_limiting:61
FAIL: TestWebsocketRateLimiting.test_rate_limiting_start_ok_end_ko
Traceback (most recent call last):
  File "/data/build/odoo/addons/bus/tests/test_websocket_rate_limiting.py", line 61, in test_rate_limiting_start_ok_end_ko
    with self.assertRaises(WebSocketProtocolException) as cm:
  File "/usr/local/lib/python3.11/contextlib.py", line 144, in __exit__
    next(self.gen)
  File "/data/build/odoo/odoo/tests/common.py", line 428, in _assertRaises
    with ExitStack() as inner:
  File "/usr/local/lib/python3.11/contextlib.py", line 589, in __exit__
    raise exc_details[1]
  File "/usr/local/lib/python3.11/contextlib.py", line 574, in __exit__
    if cb(*exc_details):
       ^^^^^^^^^^^^^^^^
AssertionError: WebSocketProtocolException not raised
2023-12-04 06:38:51 ERROR server odoo.tests.result:590 2 failed, 1 error(s) of 1123 tests when loading database '41868-17-0-all'
2023-12-04 06:38:51 WARNING server py.warnings:293
/usr/local/lib/python3.11/site-packages/coverage/pytracer.py:187: DeprecationWarning: currentThread() is deprecated, use current_thread() instead
  File "<frozen runpy>", line 198, in _run_module_as_main
  File "<frozen runpy>", line 88, in _run_code
  File "/usr/local/lib/python3.11/site-packages/coverage/__main__.py", line 8, in <module>
    sys.exit(main())
  File "/usr/local/lib/python3.11/site-packages/coverage/cmdline.py", line 756, in main
    status = CoverageScript().command_line(argv)
  File "/usr/local/lib/python3.11/site-packages/coverage/cmdline.py", line 491, in command_line
    return self.do_run(options, args)
  File "/usr/local/lib/python3.11/site-packages/coverage/cmdline.py", line 635, in do_run
    self.coverage.stop()
  File "/usr/local/lib/python3.11/site-packages/coverage/control.py", line 707, in stop
    self.collector.stop()
  File "/usr/local/lib/python3.11/site-packages/coverage/collector.py", line 331, in stop
    self.pause()
  File "/usr/local/lib/python3.11/site-packages/coverage/collector.py", line 342, in pause
    tracer.stop()
  File "/usr/local/lib/python3.11/site-packages/coverage/pytracer.py", line 187, in stop
    if self.threading and self.thread.ident != self.threading.currentThread().ident:
2023-12-04 06:38:51 INFO runbot Start getting coverage result
2023-12-04 06:38:51 WARNING runbot Coverage file not found
2023-12-04 06:38:51 INFO runbot Getting results for build 41868-17-0
2023-12-04 06:38:51 INFO runbot Getting stats from log file
2023-12-04 06:38:51 Step tests_coverage finished in 13m
2023-12-04 06:38:51 Coverage report: xml , html